Target
Membrane primary amine oxidase
Ligand
BDBM412590
Substrate
Meas. Tech.
Biological Assay of the SSAO Enzyme Inhibitors
IC50
<1000±n/a nM
Citation
 Savory, EHigginbottom, MOliver, KHorgan, VA Compounds I US Patent  US10399973 Publication Date 9/3/2019 
Target
Name:
Membrane primary amine oxidase
Synonyms:
AOC3 Amine oxidase, copper containing Semicarbazide-sensitive amine oxidase/ Vascular adhesion protein 1 (SSAO/VAP-1) Vascular adhesion protein 1 (VAP-1)
Type:
Protein
Mol. Mass.:
84620.86
Organism:
Homo sapiens (Human)
Description:
Q16853
Residue:
763
  
Inhibitor
Name:
BDBM412590
Synonyms:
Pyridin-4-ylmethyl 4-isopropyl-1,4,6,7-tetrahydro-5H-imidazo[4,5-c]pyridine-5-carboxylate | US10399973, Example 8
Type:
Small organic molecule
Emp. Form.:
C16H20N4O2
Mol. Mass.:
300.3556
SMILES:
CC(C)C1N(CCc2nc[nH]c12)C(=O)OCc1ccncc1
: