Target
Dual specificity protein kinase TTK
Ligand
BDBM412609
Substrate
Meas. Tech.
Measurement of Inhibition of MPS1 Kinase
IC50
2.00±n/a nM
Citation
 Woodward, HInnocenti, PNaud, SBlagg, JHoelder, S N2-phenyl-pyrido[3,4-D]pyrimidine-2, 8-diamine derivatives and their use as Mps1 inhibitors US Patent  US10399974 Publication Date 9/3/2019 
Target
Name:
Dual specificity protein kinase TTK
Synonyms:
Dual specificity protein kinase (TTK) MPS1 Monopolar Spindle 1 (MPS1) Monopolar Spindle 1 Kinase (MPS1) TTK | TTK_HUMAN
Type:
Protein
Mol. Mass.:
97086.79
Organism:
Homo sapiens (Human)
Description:
P33981
Residue:
857
  
Inhibitor
Name:
BDBM412609
Synonyms:
N2-(2-ethoxy-4-(4-methyl-4H-1,2,4-triazol-3-yl)phenyl)-6-methyl-N8-((3-methyltetrahydrofuran-3-yl)methyl)pyrido[3,4-d]pyrimidine-2,8-diamine | US10399974, Example 2
Type:
Small organic molecule
Emp. Form.:
C25H30N8O2
Mol. Mass.:
474.5581
SMILES:
CCOc1cc(ccc1Nc1ncc2cc(C)nc(NCC3(C)CCOC3)c2n1)-c1nncn1C
: