Target
Dual specificity protein kinase TTK
Ligand
BDBM412645
Substrate
Meas. Tech.
Measurement of Inhibition of MPS1 Kinase
IC50
3.00±n/a nM
Citation
 Woodward, HInnocenti, PNaud, SBlagg, JHoelder, S N2-phenyl-pyrido[3,4-D]pyrimidine-2, 8-diamine derivatives and their use as Mps1 inhibitors US Patent  US10399974 Publication Date 9/3/2019 
Target
Name:
Dual specificity protein kinase TTK
Synonyms:
Dual specificity protein kinase (TTK) MPS1 Monopolar Spindle 1 (MPS1) Monopolar Spindle 1 Kinase (MPS1) TTK | TTK_HUMAN
Type:
Protein
Mol. Mass.:
97086.79
Organism:
Homo sapiens (Human)
Description:
P33981
Residue:
857
  
Inhibitor
Name:
BDBM412645
Synonyms:
US10399974, Example 43
Type:
Small organic molecule
Emp. Form.:
C25H27N9O
Mol. Mass.:
469.5416
SMILES:
CCOc1cc(ccc1Nc1ncc2cc(C)nc(N3CCC(C)(C3)C#N)c2n1)-c1nncn1C
: