Target
Integrase
Ligand
BDBM294834
Substrate
Meas. Tech.
Anti-HIV Activity MT4 Assay
IC50
2.00±n/a nM
Citation
 Johns, BAVelthuisen, EJWeatherhead, JGSuwandi, LTemelkoff, D Isoindoline derivatives for use in the treatment of a viral infection US Patent  US10112899 Publication Date 10/30/2018 
Target
Name:
Integrase
Synonyms:
Human immunodeficiency virus type 1 integrase
Type:
PROTEIN
Mol. Mass.:
32231.48
Organism:
Human immunodeficiency virus 1
Description:
ChEMBL_90865
Residue:
288
  
Inhibitor
Name:
BDBM294834
Synonyms:
US10112899, Example 305
Type:
Small organic molecule
Emp. Form.:
C33H36FNO5
Mol. Mass.:
545.641
SMILES:
Cc1c2CN(Cc2c(C)c(-c2ccc3OCCCc3c2C)c1[C@H](OC(C)(C)C)C(O)=O)C(=O)c1cccc(F)c1
: