Target
cAMP and cAMP-inhibited cGMP 3',5'-cyclic phosphodiesterase 10A
Ligand
BDBM412707
Substrate
Meas. Tech.
PDE10A Scintillation Proximity Assay
IC50
27.7±n/a nM
Citation
 Flohr, AGroebke Zbinden, K (Hetero)aryl imidazoles/pyrazoles for treatment of neurological disorders US Patent  US10399985 Publication Date 9/3/2019 
Target
Name:
cAMP and cAMP-inhibited cGMP 3',5'-cyclic phosphodiesterase 10A
Synonyms:
3',5'-cyclic phosphodiesterase PDE10_HUMAN Phosphodiesterase 10A
Type:
Protein
Mol. Mass.:
88412.52
Organism:
Homo sapiens (Human)
Description:
Q9Y233
Residue:
779
  
Inhibitor
Name:
BDBM412707
Synonyms:
2,3-Dimethyl-6-(2-(1- methyl-3-phenyl-1H- 1,2,4-triazol-5- yl)ethyl)imidazo[1,2- b]pyridazine | US10399985, Example 21
Type:
Small organic molecule
Emp. Form.:
C19H20N6
Mol. Mass.:
332.4023
SMILES:
Cc1nc2ccc(CCc3nc(nn3C)-c3ccccc3)nn2c1C
: