Target
TGF-beta receptor type-1 [4-503,T204D]
Ligand
BDBM412749
Substrate
Meas. Tech.
Biological Assays
IC50
0.910±n/a nM
Citation
 Harikrishnan, LSFink, BEBorzilleri, RMTonukunuru, GSankara Warrier, J TGF beta receptor antagonists US Patent  US10399987 Publication Date 9/3/2019 
Target
Name:
TGF-beta receptor type-1 [4-503,T204D]
Synonyms:
ALK5 TGF-beta receptor type-1 T204D TGFR-1 T204D | TGFR1_HUMAN
Type:
Enzyme Catalytic Domain
Mol. Mass.:
55650.84
Organism:
Homo sapiens (Human)
Description:
P36897 T204D
Residue:
500
  
Inhibitor
Name:
BDBM412749
Synonyms:
2-(5-fluoropyridin-2-yl)-N-(3-fluoropyridin-4-yl)-7H-pyrrolo[2,3-d]pyrimidin-4-amine | US10399987, Example 14
Type:
Small organic molecule
Emp. Form.:
C16H10F2N6
Mol. Mass.:
324.2876
SMILES:
Fc1ccc(nc1)-c1nc(Nc2ccncc2F)c2cc[nH]c2n1
: