Target
TGF-beta receptor type-2
Ligand
BDBM412763
Substrate
Meas. Tech.
Biological Assays
IC50
>15000±n/a nM
Citation
 Harikrishnan, LSFink, BEBorzilleri, RMTonukunuru, GSankara Warrier, J TGF beta receptor antagonists US Patent  US10399987 Publication Date 9/3/2019 
Target
Name:
TGF-beta receptor type-2
Synonyms:
TGF-beta receptor type II TGFR2_HUMAN
Type:
PROTEIN
Mol. Mass.:
64559.49
Organism:
Homo sapiens (Human)
Description:
ChEMBL_586859
Residue:
567
  
Inhibitor
Name:
BDBM412763
Synonyms:
N-(4-((2-(6-(trifluoromethyl)pyridin-2-yl)-7H-pyrrolo[2,3-d]pyrimidin-4-yl)amino)pyridin-2-yl)methanesulfonamide | US10399987, Example 28
Type:
Small organic molecule
Emp. Form.:
C18H14F3N7O2S
Mol. Mass.:
449.41
SMILES:
CS(=O)(=O)Nc1cc(Nc2nc(nc3[nH]ccc23)-c2cccc(n2)C(F)(F)F)ccn1
: