Target
Potassium voltage-gated channel subfamily A member 3
Ligand
BDBM412897
Substrate
Meas. Tech.
Patch-Clamp Assay for Inhibitory Activity on Kv1.3
IC50
2250±n/a nM
Citation
 Tasler, SKrimmelbein, I Kv1.3 inhibitors and their medical applications US Patent  US10399991 Publication Date 9/3/2019 
Target
Name:
Potassium voltage-gated channel subfamily A member 3
Synonyms:
HGK5 HPCN3 KCNA3 Potassium voltage-gated channel subfamily A member 3 Voltage-gated potassium channel subunit Kv1.3
Type:
PROTEIN
Mol. Mass.:
63835.47
Organism:
Homo sapiens (Human)
Description:
ChEMBL_1513935
Residue:
575
  
Inhibitor
Name:
BDBM412897
Synonyms:
US10399991, Example 14 | US10822345, Ex 14
Type:
Small organic molecule
Emp. Form.:
C24H23NO4
Mol. Mass.:
389.4437
SMILES:
Cc1c(CN2CCOCC2)oc2c(C)c3oc(=O)cc(-c4ccccc4)c3cc12
: