Target
Potassium voltage-gated channel subfamily A member 3
Ligand
BDBM412940
Substrate
Meas. Tech.
Patch-Clamp Assay for Inhibitory Activity on Kv1.3
IC50
2250±n/a nM
Citation
 Tasler, SKrimmelbein, I Kv1.3 inhibitors and their medical applications US Patent  US10399991 Publication Date 9/3/2019 
Target
Name:
Potassium voltage-gated channel subfamily A member 3
Synonyms:
HGK5 HPCN3 KCNA3 Potassium voltage-gated channel subfamily A member 3 Voltage-gated potassium channel subunit Kv1.3
Type:
PROTEIN
Mol. Mass.:
63835.47
Organism:
Homo sapiens (Human)
Description:
ChEMBL_1513935
Residue:
575
  
Inhibitor
Name:
BDBM412940
Synonyms:
US10399991, Example 57 | US10822345, Ex 57
Type:
Small organic molecule
Emp. Form.:
C18H13NO3
Mol. Mass.:
291.3007
SMILES:
Cc1coc2c(C)c3oc(=O)cc(-c4ccccn4)c3cc12
: