Target
G-protein coupled receptor 6
Ligand
BDBM191037
Substrate
Meas. Tech.
Competition Binding Assay
Ki
6.00±n/a nM
Citation
 Brown, JWHitchcock, SHopkins, MKikuchi, SMonenschein, HReichard, HSchleicher, KSun, HMacklin, T Tetrahydropyridopyrazine modulators of GPR6 US Patent  US10406157 Publication Date 9/10/2019 
Target
Name:
G-protein coupled receptor 6
Synonyms:
G-protein coupled receptor 6 (GPR6) GPR6_HUMAN | Sphingosine 1-phosphate receptor GPR6
Type:
Protein
Mol. Mass.:
37886.39
Organism:
Homo sapiens (Human)
Description:
P46095
Residue:
362
  
Inhibitor
Name:
BDBM191037
Synonyms:
US10077266, Example 149 US9181249, 149 | US9708313, 149
Type:
Small organic molecule
Emp. Form.:
C24H29F2N5O3
Mol. Mass.:
473.5156
SMILES:
CC(=O)N1CCc2nc(N3CCC(CC3)Oc3ccc(F)cc3F)c(N[C@H]3CCOC3)nc2C1
: