Target
Egl nine homolog 1 [181-417]
Ligand
BDBM413216
Substrate
Meas. Tech.
Inhibition Assay
IC50
4.37±n/a nM
Citation
 Brown, JWDavis, MIvetac, AJones, BKiryanov, AAKuehler, JLanier, MMiura, JMurphy, SWang, X 6-(5-hydroxy-1H-pyrazol-1-yl)nicotinamide inhibitors of PHD US Patent  US10407409 Publication Date 9/10/2019 
Target
Name:
Egl nine homolog 1 [181-417]
Synonyms:
C1orf12 EGLN1_HUMAN | Egl nine homolog 1 (aa 181-417)
Type:
Enzyme
Mol. Mass.:
26555.51
Organism:
Homo sapiens (Human)
Description:
aa 181-417
Residue:
237
  
Inhibitor
Name:
BDBM413216
Synonyms:
(R)-2-fluoro-4-(5-hydroxy-1-(5-(4-isopropyl-3-methylpiperazine-1-carbonyl)pyridin-2-yl)-1H-pyrazol-4-yl)-3-methylbenzonitrile | US10407409, Example 337
Type:
Small organic molecule
Emp. Form.:
C25H27FN6O2
Mol. Mass.:
462.5193
SMILES:
CC(C)N1CCN(C[C@H]1C)C(=O)c1ccc(nc1)-n1ncc(c1O)-c1ccc(C#N)c(F)c1C
: