Target
Histone-lysine N-methyltransferase EHMT2
Ligand
BDBM413395
Substrate
Meas. Tech.
G9a Enzyme Activity Assay
IC50
5500±n/a nM
Citation
 Aguirre Ena, XOyarzabal Santamarina, JPrósper Cardoso, FRabal Gracia, MOSan José Enériz, ESánchez Arias, JA Compounds as inhibitors of DNA methyltransferases US Patent  US10407423 Publication Date 9/10/2019 
Target
Name:
Histone-lysine N-methyltransferase EHMT2
Synonyms:
BAT8 EHMT2 G9A Histone-lysine N-methyltransferase EHMT1/EHMT2 KMT1C Protein G9a (G9a)
Type:
Enzyme
Mol. Mass.:
132339.87
Organism:
Homo sapiens (Human)
Description:
Q96KQ7
Residue:
1210
  
Inhibitor
Name:
BDBM413395
Synonyms:
US10407423, Compound 2-02
Type:
Small organic molecule
Emp. Form.:
C24H29N3O2
Mol. Mass.:
391.506
SMILES:
Cc1ccc(o1)-c1nc2cc(OCCCN3CCCC3)ccc2c2NCCCc12
: