Target
DNA (cytosine-5)-methyltransferase 1
Ligand
BDBM413395
Substrate
Meas. Tech.
DNMT1 Enzyme Activity Assay
IC50
750±n/a nM
Citation
 Aguirre Ena, XOyarzabal Santamarina, JPrósper Cardoso, FRabal Gracia, MOSan José Enériz, ESánchez Arias, JA Compounds as inhibitors of DNA methyltransferases US Patent  US10407423 Publication Date 9/10/2019 
Target
Name:
DNA (cytosine-5)-methyltransferase 1
Synonyms:
AIM CXXC9 DNA (cytosine-5)-methyltransferase 1 isoform b DNA methyltransferase HsaI DNMT1 M.HsaI | MCMT
Type:
Enzyme
Mol. Mass.:
183184.85
Organism:
Homo sapiens (Human)
Description:
P26358
Residue:
1616
  
Inhibitor
Name:
BDBM413395
Synonyms:
US10407423, Compound 2-02
Type:
Small organic molecule
Emp. Form.:
C24H29N3O2
Mol. Mass.:
391.506
SMILES:
Cc1ccc(o1)-c1nc2cc(OCCCN3CCCC3)ccc2c2NCCCc12
: