Target
Histone-lysine N-methyltransferase EHMT2
Ligand
BDBM413403
Substrate
Meas. Tech.
G9a Enzyme Activity Assay
IC50
<100±n/a nM
Citation
 Aguirre Ena, XOyarzabal Santamarina, JPrósper Cardoso, FRabal Gracia, MOSan José Enériz, ESánchez Arias, JA Compounds as inhibitors of DNA methyltransferases US Patent  US10407423 Publication Date 9/10/2019 
Target
Name:
Histone-lysine N-methyltransferase EHMT2
Synonyms:
BAT8 EHMT2 G9A Histone-lysine N-methyltransferase EHMT1/EHMT2 KMT1C Protein G9a (G9a)
Type:
Enzyme
Mol. Mass.:
132339.87
Organism:
Homo sapiens (Human)
Description:
Q96KQ7
Residue:
1210
  
Inhibitor
Name:
BDBM413403
Synonyms:
US10407423, Compound 2-10
Type:
Small organic molecule
Emp. Form.:
C32H44N4O3
Mol. Mass.:
532.7168
SMILES:
COc1cc2c3N[C@H](CC4CCN(C)CC4)CCc3c(nc2cc1OCCCN1CCCC1)-c1ccc(C)o1
: