Target
DNA (cytosine-5)-methyltransferase 1
Ligand
BDBM413406
Substrate
Meas. Tech.
DNMT1 Enzyme Activity Assay
IC50
5500±n/a nM
Citation
 Aguirre Ena, XOyarzabal Santamarina, JPrósper Cardoso, FRabal Gracia, MOSan José Enériz, ESánchez Arias, JA Compounds as inhibitors of DNA methyltransferases US Patent  US10407423 Publication Date 9/10/2019 
Target
Name:
DNA (cytosine-5)-methyltransferase 1
Synonyms:
AIM CXXC9 DNA (cytosine-5)-methyltransferase 1 isoform b DNA methyltransferase HsaI DNMT1 M.HsaI | MCMT
Type:
Enzyme
Mol. Mass.:
183184.85
Organism:
Homo sapiens (Human)
Description:
P26358
Residue:
1616
  
Inhibitor
Name:
BDBM413406
Synonyms:
US10407423, Compound 2-13
Type:
Small organic molecule
Emp. Form.:
C33H46N4O3
Mol. Mass.:
546.7433
SMILES:
COc1cc2c3NC(CC4CCN(C)CC4)CCc3c(nc2cc1OCCCN1CCCC1)-c1cc(C)oc1C
: