Target
Tyrosine-protein kinase JAK3 [811-1124]
Ligand
BDBM50193995
Substrate
Meas. Tech.
Kinase Assay
pH
7.5±n/a
IC50
20.0±n/a nM
Comments
extracted
Citation
 Bursulaya, BFisch, ALajiness, JPMachauer, RMalekar, SPetrassi, HMRamazani, FRemond, AUllrich, TUsselmann, PVangrevelinghe, E Substituted indazoles for treating tendon and/or ligament injuries US Patent  US10112907 Publication Date 10/30/2018 
Target
Name:
Tyrosine-protein kinase JAK3 [811-1124]
Synonyms:
JAK3 JAK3_HUMAN | Tyrosine-protein kinase JAK3 (aa 811-1124)
Type:
Protein
Mol. Mass.:
35601.85
Organism:
Homo sapiens (Human)
Description:
P52333[811-1124]
Residue:
314
  
Inhibitor
Name:
BDBM50193995
Synonyms:
3-((3R,4R)-4-methyl-3-(methyl(7H-pyrrolo[2,3-d]pyrimidin-4-yl)amino)piperidin-1-yl)-3-oxopropanenitrile 3-{(3R,4R)-4-methyl-3-[methyl(7H-pyrrolo[2,3-d]pyrimidin-4-yl)amino]piperidin-1-yl}-3-oxopropanenitrile CP-690550 Tofacitinib US10112907, Example 00035 US10766894, Compound TABLE 1.20 US11078206, Example Tofacitinib US11339167, Example Tofacitinib
Type:
Small organic molecule
Emp. Form.:
C16H20N6O
Mol. Mass.:
312.3696
SMILES:
C[C@@H]1CCN(C[C@@H]1N(C)c1ncnc2[nH]ccc12)C(=O)CC#N
: