Target
Toll-like receptor 7
Ligand
BDBM413431
Substrate
Meas. Tech.
Reporter Gene Assay
EC50
200±n/a nM
Citation
 Cortez, AHoffman, TLi, YWu, TYZhang, X Compounds and compositions as toll-like receptor 7 agonists US Patent  US10407431 Publication Date 9/10/2019 
Target
Name:
Toll-like receptor 7
Synonyms:
ORF Names:UNQ248/PRO285 TLR7_HUMAN | Toll-like receptor 7 (TLR7)
Type:
Enzyme
Mol. Mass.:
120945.35
Organism:
Homo sapiens (Human)
Description:
Q9NYK1
Residue:
1049
  
Inhibitor
Name:
BDBM413431
Synonyms:
2-(benzyloxy)-2-oxoethyl 2-(4-{[2-amino-4-(pentylamino)-5H-pyrrolo[3,2-d]pyrimidin-5-yl]methyl}-3-methoxyphenyl)acetate | US10407431, Example 18
Type:
Small organic molecule
Emp. Form.:
C30H35N5O5
Mol. Mass.:
545.6294
SMILES:
CCCCCNc1nc(N)nc2ccn(Cc3ccc(CC(=O)OCC(=O)OCc4ccccc4)cc3OC)c12
: