Target
Toll-like receptor 7
Ligand
BDBM413446
Substrate
Meas. Tech.
Reporter Gene Assay
EC50
7.00±n/a nM
Citation
 Cortez, AHoffman, TLi, YWu, TYZhang, X Compounds and compositions as toll-like receptor 7 agonists US Patent  US10407431 Publication Date 9/10/2019 
Target
Name:
Toll-like receptor 7
Synonyms:
ORF Names:UNQ248/PRO285 TLR7_HUMAN | Toll-like receptor 7 (TLR7)
Type:
Enzyme
Mol. Mass.:
120945.35
Organism:
Homo sapiens (Human)
Description:
Q9NYK1
Residue:
1049
  
Inhibitor
Name:
BDBM413446
Synonyms:
(S)-2-((2-amino-5-(2-methoxy-4-(piperazin-1-ylmethyl)benzyl)-5H-pyrrolo[3,2-d]pyrimidin-4-yl)amino)hexan-1-ol | US10407431, Example 33
Type:
Small organic molecule
Emp. Form.:
C25H37N7O2
Mol. Mass.:
467.607
SMILES:
CCCC[C@@H](CO)Nc1nc(N)nc2ccn(Cc3ccc(CN4CCNCC4)cc3OC)c12
: