Target
Retinol-binding protein 4
Ligand
BDBM249472
Substrate
Meas. Tech.
Scintillation Proximity Binding Assay
IC50
17.1±n/a nM
Citation
 Petrukhin, KCioffi, CJohnson, GAllikmets, RFreeman, EChen, PConlon, MZhu, L Substituted 4-phenylpiperidines, their preparation and use US Patent  US10407433 Publication Date 9/10/2019 
Target
Name:
Retinol-binding protein 4
Synonyms:
PRBP RBP RET4_HUMAN Retinol-binding protein 4 (RBP4) | spa binding assay for rbp4
Type:
Protein
Mol. Mass.:
23008.75
Organism:
Homo sapiens (Human)
Description:
P02753
Residue:
201
  
Inhibitor
Name:
BDBM249472
Synonyms:
US10072016, Compound 71 US10913746, Compound 71 US9434727, 71 | US9777010, Compound 71
Type:
Small organic molecule
Emp. Form.:
C21H21F7N4O
Mol. Mass.:
478.4065
SMILES:
Fc1cccc(C2CCN(CC2)C(=O)c2n[nH]c3CCN(CC(F)(F)F)Cc23)c1C(F)(F)F
: