Target
Retinol-binding protein 4
Ligand
BDBM249510
Substrate
Meas. Tech.
Scintillation Proximity Binding Assay
IC50
25.2±n/a nM
Citation
 Petrukhin, KCioffi, CJohnson, GAllikmets, RFreeman, EChen, PConlon, MZhu, L Substituted 4-phenylpiperidines, their preparation and use US Patent  US10407433 Publication Date 9/10/2019 
Target
Name:
Retinol-binding protein 4
Synonyms:
PRBP RBP RET4_HUMAN Retinol-binding protein 4 (RBP4) | spa binding assay for rbp4
Type:
Protein
Mol. Mass.:
23008.75
Organism:
Homo sapiens (Human)
Description:
P02753
Residue:
201
  
Inhibitor
Name:
BDBM249510
Synonyms:
US10072016, Compound 108 US10913746, Compound 108 US9434727, 108 | US9777010, Compound 108
Type:
Small organic molecule
Emp. Form.:
C21H20F8N4O
Mol. Mass.:
496.3969
SMILES:
Fc1ccc(C2CCN(CC2)C(=O)c2n[nH]c3CN(CCC(F)(F)F)Cc23)c(c1F)C(F)(F)F
: