Target
Retinol-binding protein 4
Ligand
BDBM249542
Substrate
Meas. Tech.
Scintillation Proximity Binding Assay
IC50
9.28±n/a nM
Citation
 Petrukhin, KCioffi, CJohnson, GAllikmets, RFreeman, EChen, PConlon, MZhu, L Substituted 4-phenylpiperidines, their preparation and use US Patent  US10407433 Publication Date 9/10/2019 
Target
Name:
Retinol-binding protein 4
Synonyms:
PRBP RBP RET4_HUMAN Retinol-binding protein 4 (RBP4) | spa binding assay for rbp4
Type:
Protein
Mol. Mass.:
23008.75
Organism:
Homo sapiens (Human)
Description:
P02753
Residue:
201
  
Inhibitor
Name:
BDBM249542
Synonyms:
US10072016, Compound 140 US10913746, Compound 140 US9434727, 140 | US9777010, Compound 140
Type:
Small organic molecule
Emp. Form.:
C21H22F4N4O2
Mol. Mass.:
438.4186
SMILES:
CC(=O)N1CCc2c(C1)[nH]nc2C(=O)N1CCC(CC1)c1cc(F)ccc1C(F)(F)F
: