Target
Retinol-binding protein 4
Ligand
BDBM249546
Substrate
Meas. Tech.
Scintillation Proximity Binding Assay
IC50
6.17±n/a nM
Citation
 Petrukhin, KCioffi, CJohnson, GAllikmets, RFreeman, EChen, PConlon, MZhu, L Substituted 4-phenylpiperidines, their preparation and use US Patent  US10407433 Publication Date 9/10/2019 
Target
Name:
Retinol-binding protein 4
Synonyms:
PRBP RBP RET4_HUMAN Retinol-binding protein 4 (RBP4) | spa binding assay for rbp4
Type:
Protein
Mol. Mass.:
23008.75
Organism:
Homo sapiens (Human)
Description:
P02753
Residue:
201
  
Inhibitor
Name:
BDBM249546
Synonyms:
US10072016, Compound 144 US10913746, Compound 144 US9434727, 144 | US9777010, Compound 144
Type:
Small organic molecule
Emp. Form.:
C19H22ClFN4O3S
Mol. Mass.:
440.919
SMILES:
CS(=O)(=O)N1CCc2[nH]nc(C(=O)N3CCC(CC3)c3cc(F)ccc3Cl)c2C1
: