Target
Retinol-binding protein 4
Ligand
BDBM249566
Substrate
Meas. Tech.
Scintillation Proximity Binding Assay
IC50
13.6±n/a nM
Citation
 Petrukhin, KCioffi, CJohnson, GAllikmets, RFreeman, EChen, PConlon, MZhu, L Substituted 4-phenylpiperidines, their preparation and use US Patent  US10407433 Publication Date 9/10/2019 
Target
Name:
Retinol-binding protein 4
Synonyms:
PRBP RBP RET4_HUMAN Retinol-binding protein 4 (RBP4) | spa binding assay for rbp4
Type:
Protein
Mol. Mass.:
23008.75
Organism:
Homo sapiens (Human)
Description:
P02753
Residue:
201
  
Inhibitor
Name:
BDBM249566
Synonyms:
US10072016, Compound 164 US10913746, Compound 164 US9434727, 164 | US9777010, Compound 164
Type:
Small organic molecule
Emp. Form.:
C22H26ClFN4O
Mol. Mass.:
416.919
SMILES:
Fc1cccc(C2CCN(CC2)C(=O)c2n[nH]c3CCN(CC4CC4)Cc23)c1Cl
: