Target
Dual specificity protein kinase TTK
Ligand
BDBM413450
Substrate
Meas. Tech.
Enzyme Assay
IC50
5012±n/a nM
Citation
 Finlay, MRGoldberg, FWTing, AK Amino-triazolopyridine compounds and their use in treating cancer US Patent  US10407446 Publication Date 9/10/2019 
Target
Name:
Dual specificity protein kinase TTK
Synonyms:
Dual specificity protein kinase (TTK) MPS1 Monopolar Spindle 1 (MPS1) Monopolar Spindle 1 Kinase (MPS1) TTK | TTK_HUMAN
Type:
Protein
Mol. Mass.:
97086.79
Organism:
Homo sapiens (Human)
Description:
P33981
Residue:
857
  
Inhibitor
Name:
BDBM413450
Synonyms:
7-methyl-2-((7-methyl-[1,2,4]triazolo[1,5-a]pyridin-6-yl)amino)-9-(tetrahydro-2H-pyran-4-yl)-7,9-dihydro-8H-purin-8-one US11136340, Example 3
Type:
Small organic molecule
Emp. Form.:
C18H20N8O2
Mol. Mass.:
380.4038
SMILES:
Cc1cc2ncnn2cc1Nc1ncc2n(C)c(=O)n(C3CCOCC3)c2n1
: