Target
Aurora kinase A
Ligand
BDBM413450
Substrate
Meas. Tech.
Enzyme Assay
IC50
<10000±n/a nM
Citation
 Finlay, MRGoldberg, FWTing, AK Amino-triazolopyridine compounds and their use in treating cancer US Patent  US10407446 Publication Date 9/10/2019 
Target
Name:
Aurora kinase A
Synonyms:
AIK ARK1 AURKA AYK1 Aurora kinase A (AURA) Aurora kinase A (Aurora A) Aurora-related kinase 1 BTAK Breast-tumor-amplified kinase STK15 Serine/threonine kinase 15 Serine/threonine-protein kinase aurora A hARK1
Type:
Serine/threonine-protein kinase
Mol. Mass.:
45830.98
Organism:
Homo sapiens (Human)
Description:
O14965
Residue:
403
  
Inhibitor
Name:
BDBM413450
Synonyms:
7-methyl-2-((7-methyl-[1,2,4]triazolo[1,5-a]pyridin-6-yl)amino)-9-(tetrahydro-2H-pyran-4-yl)-7,9-dihydro-8H-purin-8-one US11136340, Example 3
Type:
Small organic molecule
Emp. Form.:
C18H20N8O2
Mol. Mass.:
380.4038
SMILES:
Cc1cc2ncnn2cc1Nc1ncc2n(C)c(=O)n(C3CCOCC3)c2n1
: