Target
Aurora kinase A
Ligand
BDBM413453
Substrate
Meas. Tech.
Enzyme Assay
IC50
<10000±n/a nM
Citation
 Finlay, MRGoldberg, FWTing, AK Amino-triazolopyridine compounds and their use in treating cancer US Patent  US10407446 Publication Date 9/10/2019 
Target
Name:
Aurora kinase A
Synonyms:
AIK ARK1 AURKA AYK1 Aurora kinase A (AURA) Aurora kinase A (Aurora A) Aurora-related kinase 1 BTAK Breast-tumor-amplified kinase STK15 Serine/threonine kinase 15 Serine/threonine-protein kinase aurora A hARK1
Type:
Serine/threonine-protein kinase
Mol. Mass.:
45830.98
Organism:
Homo sapiens (Human)
Description:
O14965
Residue:
403
  
Inhibitor
Name:
BDBM413453
Synonyms:
9-((1r,4r)-methoxycyclohexyl)-7-methyl-2-((7-methyl-[1,2,4]triazolo[1,5-a]pyridin-6-yl)amino)-7,9-dihydro-8H-purin-8-one US11136340, Example 6
Type:
Small organic molecule
Emp. Form.:
C20H24N8O2
Mol. Mass.:
408.457
SMILES:
CO[C@H]1CC[C@@H](CC1)n1c2nc(Nc3cn4ncnc4cc3C)ncc2n(C)c1=O
: