Target
Aurora kinase B
Ligand
BDBM413454
Substrate
Meas. Tech.
Enzyme Assay
IC50
<10000±n/a nM
Citation
 Finlay, MRGoldberg, FWTing, AK Amino-triazolopyridine compounds and their use in treating cancer US Patent  US10407446 Publication Date 9/10/2019 
Target
Name:
Aurora kinase B
Synonyms:
AIK2 AIM1 ARK2 AURKB_HUMAN Aurora B-INCENP Aurora kinase B (AURKB) STK-1 STK12 Serine/threonine-protein kinase aurora B
Type:
Protein
Mol. Mass.:
39327.72
Organism:
Homo sapiens (Human)
Description:
Q96GD4
Residue:
344
  
Inhibitor
Name:
BDBM413454
Synonyms:
(S)-7-methyl-2-((7-methyl-[1,2,4]triazolo[1,5-a]pyridin-6-yl)amino)-9-(tetrahydro-2H-pyran-3-yl)-7,9-dihydro-8H-purin-8-one US11136340, Example 7
Type:
Small organic molecule
Emp. Form.:
C18H20N8O2
Mol. Mass.:
380.4038
SMILES:
Cc1cc2ncnn2cc1Nc1ncc2n(C)c(=O)n([C@H]3CCCOC3)c2n1
: