Target
Tyrosine-protein kinase JAK3
Ligand
BDBM413457
Substrate
Meas. Tech.
Enzyme Assay
IC50
<10000±n/a nM
Citation
 Finlay, MRGoldberg, FWTing, AK Amino-triazolopyridine compounds and their use in treating cancer US Patent  US10407446 Publication Date 9/10/2019 
Target
Name:
Tyrosine-protein kinase JAK3
Synonyms:
JAK-3 JAK3_HUMAN Janus kinase 3 (JAK3) L-JAK | Leukocyte janus kinase
Type:
Protein
Mol. Mass.:
125111.08
Organism:
Homo sapiens (Human)
Description:
P52333
Residue:
1124
  
Inhibitor
Name:
BDBM413457
Synonyms:
9-((1s,4s)-4-hydroxy-4-methylcyclohexyl)-7-methyl-2-((7-methyl-[1,2,4]triazolo[1,5-a]pyridin-6-yl)amino)-7,9-dihydro-8H-purin-8-one US11136340, Example 10
Type:
Small organic molecule
Emp. Form.:
C20H24N8O2
Mol. Mass.:
408.457
SMILES:
Cc1cc2ncnn2cc1Nc1ncc2n(C)c(=O)n([C@H]3CC[C@@](C)(O)CC3)c2n1
: