Target
Aurora kinase B
Ligand
BDBM413459
Substrate
Meas. Tech.
Enzyme Assay
IC50
<10000±n/a nM
Citation
 Finlay, MRGoldberg, FWTing, AK Amino-triazolopyridine compounds and their use in treating cancer US Patent  US10407446 Publication Date 9/10/2019 
Target
Name:
Aurora kinase B
Synonyms:
AIK2 AIM1 ARK2 AURKB_HUMAN Aurora B-INCENP Aurora kinase B (AURKB) STK-1 STK12 Serine/threonine-protein kinase aurora B
Type:
Protein
Mol. Mass.:
39327.72
Organism:
Homo sapiens (Human)
Description:
Q96GD4
Residue:
344
  
Inhibitor
Name:
BDBM413459
Synonyms:
9-((1s,4s)-4-hydroxy-1-methylcyclohexyl)-7-methyl-2-((7-methyl-[1,2,4]triazolo[1,5-a]pyridin-6-yl)amino)-7,9-dihydro-8H-purin-8-one US11136340, Example 12
Type:
Small organic molecule
Emp. Form.:
C20H24N8O2
Mol. Mass.:
408.457
SMILES:
Cc1cc2ncnn2cc1Nc1ncc2n(C)c(=O)n(c2n1)[C@]1(C)CC[C@H](O)CC1
: