Target
Endoplasmin/Heat shock protein 75/Heat shock protein HSP 90-alpha/Heat shock protein HSP 90-beta
Ligand
BDBM265398
Substrate
Meas. Tech.
Malachite Green ATPase Assay
IC50
<10000±n/a nM
Citation
 Drysdale, MJDymock, BWFinch, HWebb, PMcDonald, EJames, KECheung, KMMatthews, TP Isoxazole compounds as inhibitors of heat shock proteins US Patent  US10413550 Publication Date 9/17/2019 
Target
Name:
Endoplasmin/Heat shock protein 75/Heat shock protein HSP 90-alpha/Heat shock protein HSP 90-beta
Synonyms:
Endoplasmin/Heat shock protein HSP 90-alpha/Heat shock protein HSP 90-beta/Heat shock protein, mitochondrial | HSP90
Type:
Protein
Mol. Mass.:
Description:
Components:
This complex has 4 components.
Component 1
Name:
Heat shock protein HSP 90-alpha
Synonyms:
HS90A_HUMAN HSP86 HSP90AA1 HSPCA Heat shock 86 kDa Heat shock protein HSP 90-alpha (HSP90) LAP-2 Lipopolysaccharide-associated protein 2 heat shock protein 90kDa alpha (cytosolic), class A member 1 isoform 2
Type:
Molecular Chaperone
Mol. Mass.:
84623.45
Organism:
Homo sapiens (Human)
Description:
P07900
Residue:
732
  
Component 2
Name:
Heat shock protein HSP 90-beta
Synonyms:
HS90B_HUMAN HSP 90 HSP90B HSPCB Heat shock protein HSP 90 (Hsp90)
Type:
Molecular Chaperone
Mol. Mass.:
83229.45
Organism:
Homo sapiens (Human)
Description:
P08238
Residue:
724
  
Component 3
Name:
Heat shock protein 75
Synonyms:
A9CPF9_ALLMI Heat shock protein 75 (HSP75/TRAP1) TRAP1
Type:
Mol. Mass.:
80451.37
Organism:
Alligator mississippiensis (American alligator)
Description:
A9CPF9
Residue:
708
  
Component 4
Name:
Endoplasmin
Synonyms:
94 kDa glucose-regulated protein GRP-94 Glucose regulated protein 94kDa (Grp94) Heat shock protein 90 kDa beta member 1 Tumor rejection antigen 1 | gp96 homolog
Type:
Protein
Mol. Mass.:
92417.36
Organism:
Homo sapiens (Human)
Description:
P14625
Residue:
803
  
Inhibitor
Name:
BDBM265398
Synonyms:
US10413550, Example 78t US9718793, 78t
Type:
Small organic molecule
Emp. Form.:
C28H36N4O4
Mol. Mass.:
492.6098
SMILES:
CC(C)NC(=O)c1noc(c1-c1ccc(CN2CCN(C)CC2)cc1)-c1cc(C(C)C)c(O)cc1O
: