Target
Tyrosine-protein kinase BTK
Ligand
BDBM291408
Substrate
Meas. Tech.
BTK IC50 Enzyme Assay
IC50
<100±n/a nM
Citation
 Hodous, BLLiu-Bujalski, LJones, RBankston, DJohnson, TLMochalkin, INguyen, NQiu, HGoutopoulos, ABrugger, N Compositions and methods for the production of pyrimidine and pyridine compounds with BTK inhibitory activity US Patent  US10413562 Publication Date 9/17/2019 
Target
Name:
Tyrosine-protein kinase BTK
Synonyms:
AGMX1 Agammaglobulinaemia tyrosine kinase B cell progenitor kinase BPK BTK_HUMAN Tyrosine Kinase BTK Tyrosine-protein kinase BTK (BTK)
Type:
Enzyme
Mol. Mass.:
76289.95
Organism:
Homo sapiens (Human)
Description:
Q06187
Residue:
659
  
Inhibitor
Name:
BDBM291408
Synonyms:
US10413562, Compound A119 | US9580449, Example A119
Type:
Small organic molecule
Emp. Form.:
C24H26ClN5O3S
Mol. Mass.:
500.013
SMILES:
Nc1ncnc(NC2CC3(C2)CN(C3)S(=O)(=O)CCCl)c1-c1ccc(Oc2ccccc2)cc1
: