Target
Tyrosine-protein kinase BTK
Ligand
BDBM291455
Substrate
Meas. Tech.
BTK IC50 Enzyme Assay
IC50
<100±n/a nM
Citation
 Hodous, BLLiu-Bujalski, LJones, RBankston, DJohnson, TLMochalkin, INguyen, NQiu, HGoutopoulos, ABrugger, N Compositions and methods for the production of pyrimidine and pyridine compounds with BTK inhibitory activity US Patent  US10413562 Publication Date 9/17/2019 
Target
Name:
Tyrosine-protein kinase BTK
Synonyms:
AGMX1 Agammaglobulinaemia tyrosine kinase B cell progenitor kinase BPK BTK_HUMAN Tyrosine Kinase BTK Tyrosine-protein kinase BTK (BTK)
Type:
Enzyme
Mol. Mass.:
76289.95
Organism:
Homo sapiens (Human)
Description:
Q06187
Residue:
659
  
Inhibitor
Name:
BDBM291455
Synonyms:
N-(4-((6-amino-5-(4-phenoxyphenyl)pyrimidin-4-yl)amino)bicyclo[2.1.1]hexan-1-yl)acrylamide US9580449, Example A177
Type:
Small organic molecule
Emp. Form.:
C25H25N5O2
Mol. Mass.:
427.4983
SMILES:
Nc1ncnc(NC23CC(C2)(CC3)NC(=O)C=C)c1-c1ccc(Oc2ccccc2)cc1
: