Target
Tyrosine-protein kinase BTK
Ligand
BDBM291485
Substrate
Meas. Tech.
BTK IC50 Enzyme Assay
IC50
<100±n/a nM
Citation
 Hodous, BLLiu-Bujalski, LJones, RBankston, DJohnson, TLMochalkin, INguyen, NQiu, HGoutopoulos, ABrugger, N Compositions and methods for the production of pyrimidine and pyridine compounds with BTK inhibitory activity US Patent  US10413562 Publication Date 9/17/2019 
Target
Name:
Tyrosine-protein kinase BTK
Synonyms:
AGMX1 Agammaglobulinaemia tyrosine kinase B cell progenitor kinase BPK BTK_HUMAN Tyrosine Kinase BTK Tyrosine-protein kinase BTK (BTK)
Type:
Enzyme
Mol. Mass.:
76289.95
Organism:
Homo sapiens (Human)
Description:
Q06187
Residue:
659
  
Inhibitor
Name:
BDBM291485
Synonyms:
1-((3S,5S)-3-((6-amino-5-(4-phenoxyphenyl)pyrimidin-4-yl)amino)-5-fluoropiperidin-1-yl)prop-2-en-1-one US9580449, Example A204
Type:
Small organic molecule
Emp. Form.:
C24H24FN5O2
Mol. Mass.:
433.4781
SMILES:
Nc1ncnc(N[C@H]2C[C@H](F)CN(C2)C(=O)C=C)c1-c1ccc(Oc2ccccc2)cc1
: