Target
Tyrosine-protein kinase BTK
Ligand
BDBM291527
Substrate
Meas. Tech.
BTK IC50 Enzyme Assay
IC50
<100±n/a nM
Citation
 Hodous, BLLiu-Bujalski, LJones, RBankston, DJohnson, TLMochalkin, INguyen, NQiu, HGoutopoulos, ABrugger, N Compositions and methods for the production of pyrimidine and pyridine compounds with BTK inhibitory activity US Patent  US10413562 Publication Date 9/17/2019 
Target
Name:
Tyrosine-protein kinase BTK
Synonyms:
AGMX1 Agammaglobulinaemia tyrosine kinase B cell progenitor kinase BPK BTK_HUMAN Tyrosine Kinase BTK Tyrosine-protein kinase BTK (BTK)
Type:
Enzyme
Mol. Mass.:
76289.95
Organism:
Homo sapiens (Human)
Description:
Q06187
Residue:
659
  
Inhibitor
Name:
BDBM291527
Synonyms:
N-(3-((5-(4-phenoxyphenyl)pyrimidin-4-yl)oxy)phenyl)acrylamide US9580449, Example A255
Type:
Small organic molecule
Emp. Form.:
C25H19N3O3
Mol. Mass.:
409.4367
SMILES:
C=CC(=O)Nc1cccc(Oc2ncncc2-c2ccc(Oc3ccccc3)cc2)c1
: