Target
Tyrosine-protein kinase BTK
Ligand
BDBM291540
Substrate
Meas. Tech.
BTK IC50 Enzyme Assay
IC50
<100±n/a nM
Citation
 Hodous, BLLiu-Bujalski, LJones, RBankston, DJohnson, TLMochalkin, INguyen, NQiu, HGoutopoulos, ABrugger, N Compositions and methods for the production of pyrimidine and pyridine compounds with BTK inhibitory activity US Patent  US10413562 Publication Date 9/17/2019 
Target
Name:
Tyrosine-protein kinase BTK
Synonyms:
AGMX1 Agammaglobulinaemia tyrosine kinase B cell progenitor kinase BPK BTK_HUMAN Tyrosine Kinase BTK Tyrosine-protein kinase BTK (BTK)
Type:
Enzyme
Mol. Mass.:
76289.95
Organism:
Homo sapiens (Human)
Description:
Q06187
Residue:
659
  
Inhibitor
Name:
BDBM291540
Synonyms:
N-(3-(4-((4-phenoxyphenyl)amino)pyridin-3-yl)phenyl)acrylamide US9580449, Example A267
Type:
Small organic molecule
Emp. Form.:
C26H21N3O2
Mol. Mass.:
407.4638
SMILES:
C=CC(=O)Nc1cccc(c1)-c1cnccc1Nc1ccc(Oc2ccccc2)cc1
: