Target
Isocitrate dehydrogenase [NADP] cytoplasmic [R132H]
Ligand
BDBM413507
Substrate
Meas. Tech.
Mutant IDH1 R132H Biochemical Assay
IC50
60.0±n/a nM
Citation
 Panknin, ORing, SZimmermann, KNeuhaus, R 5-hydroxyalkylbenzimidazoles as mIDH1 inhibitors US Patent  US10414734 Publication Date 9/17/2019 
Target
Name:
Isocitrate dehydrogenase [NADP] cytoplasmic [R132H]
Synonyms:
Cytosolic NADP-isocitrate dehydrogenase (IDH1)(R132H) IDH1 R132H IDHC_HUMAN Isocitrate dehydrogenase 1 mutant (R132H) Isocitrate dehydrogenase [NADP] cytoplasmic (IDH1)(R132H) PICD
Type:
Protein
Mol. Mass.:
46641.74
Organism:
Homo sapiens (Human)
Description:
Human IDH1 R132H (SEQ ID No. 2 in patent). First three are removed. Google patent parsed wrong.
Residue:
414
  
Inhibitor
Name:
BDBM413507
Synonyms:
US10414734, Example 2-16
Type:
Small organic molecule
Emp. Form.:
C30H43N3O
Mol. Mass.:
461.6819
SMILES:
CC(C)[C@@H]1CC[C@@H](C)C[C@H]1n1c(Nc2ccc(cc2)C(C)C)nc2cc(CC(C)(C)O)ccc12
: