Target
Lysine-specific histone demethylase 1A
Ligand
BDBM243410
Substrate
Meas. Tech.
Inhibition Activity Assay
IC50
<100.0±n/a nM
Citation
 Matsumoto, SHattori, YToyofuku, MMorimoto, SDaini, MKojima, TKaku, TIto, M Cyclopropanamine compound and use thereof US Patent  US10414761 Publication Date 9/17/2019 
Target
Name:
Lysine-specific histone demethylase 1A
Synonyms:
AOF2 Flavin-containing amine oxidase domain-containing protein 2 KDM1A KIAA0601 Lysine-specific demethylase 1 (LSD1) Lysine-specific histone demethylase 1 (LSD1)
Type:
Enzyme
Mol. Mass.:
92901.01
Organism:
Homo sapiens (Human)
Description:
O60341
Residue:
852
  
Inhibitor
Name:
BDBM243410
Synonyms:
N-(4,4- difluorocyclohexyl)- 5-((1R,2R)-2- (tetrahydro-2H- pyran-4-ylamino)- cyclopropyl)thio- phene-3-carboxamide US10414761, Example 44 US9718814, 44 | US9920047, 44
Type:
Small organic molecule
Emp. Form.:
C19H26F2N2O2S
Mol. Mass.:
384.484
SMILES:
FC1(F)CCC(CC1)NC(=O)c1csc(c1)[C@@H]1C[C@H]1NC1CCOCC1
: