Target
Lysine-specific histone demethylase 1A
Ligand
BDBM50153586
Substrate
Meas. Tech.
Inhibition Activity Assay
IC50
<100.0±n/a nM
Citation
 Matsumoto, SHattori, YToyofuku, MMorimoto, SDaini, MKojima, TKaku, TIto, M Cyclopropanamine compound and use thereof US Patent  US10414761 Publication Date 9/17/2019 
Target
Name:
Lysine-specific histone demethylase 1A
Synonyms:
AOF2 Flavin-containing amine oxidase domain-containing protein 2 KDM1A KIAA0601 Lysine-specific demethylase 1 (LSD1) Lysine-specific histone demethylase 1 (LSD1)
Type:
Enzyme
Mol. Mass.:
92901.01
Organism:
Homo sapiens (Human)
Description:
O60341
Residue:
852
  
Inhibitor
Name:
BDBM50153586
Synonyms:
CHEMBL3775474 US10414761, Example 71 US9718814, 71 | US9920047, 120
Type:
Small organic molecule
Emp. Form.:
C17H24N2O2S
Mol. Mass.:
320.45
SMILES:
O=C(NC1CCOCC1)c1csc(c1)[C@@H]1C[C@H]1NCC1CC1
: