Target
Protein M2-1
Ligand
BDBM294859
Substrate
Meas. Tech.
Antiviral Assay
EC50
250±n/a nM
Citation
 Gomtsian, ADekhtyar, TFrank, KEFriedman, MMJosephsohn, NMolla, MVasudevan, ANg, ICChafeev, M Substituted cyanoguanidines as oral anti-virals US Patent  US10112911 Publication Date 10/30/2018 
Target
Name:
Protein M2-1
Synonyms:
Envelope-associated 22 kDa protein M21_HRSVA | Matrix M2-1
Type:
Enzyme Catalytic Domain
Mol. Mass.:
22163.59
Organism:
Human respiratory syncytial virus A (strain A2)
Description:
P04545
Residue:
194
  
Inhibitor
Name:
BDBM294859
Synonyms:
US10112911, Example 1.3
Type:
Small organic molecule
Emp. Form.:
C24H27N7
Mol. Mass.:
413.5181
SMILES:
CC(C)C1CN(CCN1\C(Nc1ccccc1C)=N/C#N)c1cnc2ccccc2n1
: