Target
Potassium channel subfamily K member 3
Ligand
BDBM413560
Substrate
Meas. Tech.
In Vitro Electrophysiological Assay
IC50
700±n/a nM
Citation
 Delbeck, MHahn, MMüller, TMeier, HLustig, KMosig, JToschi, LAlbus, UGehring, DRosenstein, B Substituted perhydropyrrolo[3,4-c]pyrrole derivatives and the use of same US Patent  US10414765 Publication Date 9/17/2019 
Target
Name:
Potassium channel subfamily K member 3
Synonyms:
Acid-sensitive potassium channel TASK-1 KCNK3 Potassium channel protein TASK-1 Potassium channel subfamily K member 3 (TASK-1) TASK1 Two pore K(+) channel KT3.1 | Two pore potassium channel KT3.1
Type:
Protein
Mol. Mass.:
43534.71
Organism:
Homo sapiens (Human)
Description:
O14649
Residue:
394
  
Inhibitor
Name:
BDBM413560
Synonyms:
US10414765, Example 44
Type:
Small organic molecule
Emp. Form.:
C28H24BrClF3N5O
Mol. Mass.:
618.875
SMILES:
FC(F)(F)c1ccc(Cl)c(NC(=O)N2CC3CN(Cc4c(nc5ccccn45)-c4ccc(Br)cc4)CC3C2)c1
: