Target
Potassium channel subfamily K member 9
Ligand
BDBM413567
Substrate
Meas. Tech.
In Vitro Electrophysiological Assay
IC50
80.0±n/a nM
Citation
 Delbeck, MHahn, MMüller, TMeier, HLustig, KMosig, JToschi, LAlbus, UGehring, DRosenstein, B Substituted perhydropyrrolo[3,4-c]pyrrole derivatives and the use of same US Patent  US10414765 Publication Date 9/17/2019 
Target
Name:
Potassium channel subfamily K member 9
Synonyms:
Acid-sensitive potassium channel protein TASK-3 KCNK9_HUMAN TWIK-related acid-sensitive K(+) channel 3 Two pore potassium channel KT3.2
Type:
PROTEIN
Mol. Mass.:
42276.04
Organism:
Homo sapiens (Human)
Description:
ChEMBL_1457494
Residue:
374
  
Inhibitor
Name:
BDBM413567
Synonyms:
US10414765, Example 51
Type:
Small organic molecule
Emp. Form.:
C27H25Cl2N5O2
Mol. Mass.:
522.426
SMILES:
COc1ccc(Cl)c(n1)C(=O)N1CC2CN(Cc3c(nc4ccccn34)-c3ccc(Cl)cc3)CC2C1
: