Target
Interstitial collagenase
Ligand
BDBM413575
Substrate
Meas. Tech.
Inhibition Assay
IC50
3650000±n/a nM
Citation
 Prades Cosano, RSeco Moral, JTarragó Clua, MT Gelatinase inhibitors and use thereof US Patent  US10414797 Publication Date 9/17/2019 
Target
Name:
Interstitial collagenase
Synonyms:
CLG MMP1 Matrix metalloproteinase-1 | Matrix metalloproteinase-1 (MMP-1)
Type:
Enzyme
Mol. Mass.:
54010.26
Organism:
Homo sapiens (Human)
Description:
P03956
Residue:
469
  
Inhibitor
Name:
BDBM413575
Synonyms:
(2S)—N-[(1S)-1-[[(1S)-3-[(3,5-difluorobenzoyl)amino]-1-(hydroxycarbamoyl)propyl]carbamoyl]-2-methyl-butyl]-N-methyl-1-(2-propylpentanoyl)pyrrolidine-2-carboxamide | US10414797, Example 8
Type:
Small organic molecule
Emp. Form.:
C31H47F2N5O6
Mol. Mass.:
623.7316
SMILES:
CCCC(CCC)C(=O)N1CCC[C@H]1C(=O)N(C)[C@@H](C(C)CC)C(=O)N[C@@H](CCNC(=O)c1cc(F)cc(F)c1)C(=O)NO
: