Target
Glutamate receptor ionotropic, NMDA 2B
Ligand
BDBM287604
Substrate
IC50
22.0±n/a nM
Citation
 Shapiro, G Pyrrolopyrimidine derivatives as NR2B NMDA receptor antagonists US Patent  US10420768 Publication Date 9/24/2019 
Target
Name:
Glutamate receptor ionotropic, NMDA 2B
Synonyms:
GRIN2B Glutamate [NMDA] receptor subunit epsilon 2 N-methyl D-aspartate receptor subtype 2B NMDAR2B NR3 | hNR3
Type:
PROTEIN
Mol. Mass.:
166375.46
Organism:
Homo sapiens (Human)
Description:
ChEMBL_1438829
Residue:
1484
  
Inhibitor
Name:
BDBM287604
Synonyms:
US10420768, Compound C-175 US9567341, Compound C-175 | US9968610, Compound C-175
Type:
Small organic molecule
Emp. Form.:
C19H20F3N5
Mol. Mass.:
375.3908
SMILES:
Fc1ccc(cc1)C(F)(F)CN1CCC(CC1)Nc1ncnc2[nH]ccc12
: