Target
Glutamate receptor ionotropic, NMDA 2A
Ligand
BDBM287605
Substrate
IC50
>10000000±n/a nM
Citation
 Shapiro, G Pyrrolopyrimidine derivatives as NR2B NMDA receptor antagonists US Patent  US10420768 Publication Date 9/24/2019 
Target
Name:
Glutamate receptor ionotropic, NMDA 2A
Synonyms:
GRIN2A Glutamate [NMDA] receptor Glutamate [NMDA] receptor subunit epsilon-1 NMDA receptor subtype 2A protein (NR2A) NMDE1_HUMAN hNR2A
Type:
Mol. Mass.:
165293.76
Organism:
Homo sapiens (Human)
Description:
Residue:
1464
  
Inhibitor
Name:
BDBM287605
Synonyms:
US10420768, Compound C-176 | US9567341, Compound C-176
Type:
Small organic molecule
Emp. Form.:
C19H20ClF2N5
Mol. Mass.:
391.845
SMILES:
FC(F)(CN1CCC(CC1)Nc1ncnc2[nH]ccc12)c1ccc(Cl)cc1
: