Target
Glutamate receptor ionotropic, NMDA 2B
Ligand
BDBM287594
Substrate
IC50
88.0±n/a nM
Citation
 Shapiro, G Pyrrolopyrimidine derivatives as NR2B NMDA receptor antagonists US Patent  US10420768 Publication Date 9/24/2019 
Target
Name:
Glutamate receptor ionotropic, NMDA 2B
Synonyms:
GRIN2B Glutamate [NMDA] receptor subunit epsilon 2 N-methyl D-aspartate receptor subtype 2B NMDAR2B NR3 | hNR3
Type:
PROTEIN
Mol. Mass.:
166375.46
Organism:
Homo sapiens (Human)
Description:
ChEMBL_1438829
Residue:
1484
  
Inhibitor
Name:
BDBM287594
Synonyms:
US10420768, Compound C-230 US9567341, Compound C-230 | US9968610, Compound C-230
Type:
Small organic molecule
Emp. Form.:
C18H21F2N7
Mol. Mass.:
373.403
SMILES:
Cc1cnc(cn1)C(F)(F)CN1CCC(CC1)Nc1ncnc2[nH]ccc12
: