Target
Coagulation factor XI
Ligand
BDBM413864
Substrate
Meas. Tech.
Inhibition Assay
IC50
0.850±n/a nM
Citation
 Jimenez Nunez, EAckerstaff, JRöhrig, SHillisch, AMeier, KHeitmeier, STersteegen, AStampfuß, JEllerbrock, PMeibom, DLang, D Substituted oxopyridine derivatives US Patent  US10421742 Publication Date 9/24/2019 
Target
Name:
Coagulation factor XI
Synonyms:
Coagulation factor XIa Coagulation factor XIa light chain FA11_HUMAN Factor XIa PTA | Plasma thromboplastin antecedent
Type:
Enzyme
Mol. Mass.:
70130.58
Organism:
Homo sapiens (Human)
Description:
P03951
Residue:
625
  
Inhibitor
Name:
BDBM413864
Synonyms:
(2S)-2-{4-[5-Chloro-2-(4-chloro-1H-1,2,3-triazol-1-yl)phenyl]-5-methoxy-2-oxopyridin-1(2H)-yl}-4,4-difluoro-N-(quinoxalin-6-yl)butanamide (Enantiomer 2) US11180471, Example 257
Type:
Small organic molecule
Emp. Form.:
C26H19Cl2F2N7O3
Mol. Mass.:
586.377
SMILES:
COc1cn([C@@H](CC(F)F)C(=O)Nc2ccc3nccnc3c2)c(=O)cc1-c1cc(Cl)ccc1-n1cc(Cl)nn1
: