Target
Fibroblast growth factor receptor 1
Ligand
BDBM373520
Substrate
Meas. Tech.
Enzyme Binding Assay
Kd
720±n/a nM
Citation
 Vermeulen, WHostyn, SACuyckens, FAJones, RMBroggini, DF Quinoxaline derivatives useful as FGFR kinase modulators US Patent  US10421747 Publication Date 9/24/2019 
Target
Name:
Fibroblast growth factor receptor 1
Synonyms:
BFGFR Basic fibroblast growth factor receptor 1 (FGFR1) CEK FGFR-1 FGFR-1, (FL) FGFR1_HUMAN FLT2 Fibroblast growth factor receptor 1 (FGFR-1) Fms-like tyrosine kinase 2 N-sam bFGF-R | c-fgr
Type:
Receptor
Mol. Mass.:
91861.70
Organism:
Homo sapiens (Human)
Description:
P11362
Residue:
822
  
Inhibitor
Name:
BDBM373520
Synonyms:
US10421747, Compound 3 | US9902714, Compound 3
Type:
Small organic molecule
Emp. Form.:
C25H28N6O2
Mol. Mass.:
444.5288
SMILES:
COc1cc(O)c2CN(CCN(c3ccc4ncc(nc4c3)-c3cnn(C)c3)c2c1)C(C)C
: