Target
Fibroblast growth factor receptor 4
Ligand
BDBM373522
Substrate
Meas. Tech.
Enzyme Binding Assay
Kd
>3000±n/a nM
Citation
 Vermeulen, WHostyn, SACuyckens, FAJones, RMBroggini, DF Quinoxaline derivatives useful as FGFR kinase modulators US Patent  US10421747 Publication Date 9/24/2019 
Target
Name:
Fibroblast growth factor receptor 4
Synonyms:
CD_antigen: CD334 FGFR4 FGFR4 Fibroblast growth factor receptor JK2 TKF
Type:
Protein
Mol. Mass.:
87957.45
Organism:
Homo sapiens (Human)
Description:
P22455
Residue:
802
  
Inhibitor
Name:
BDBM373522
Synonyms:
US10421747, Compound 4 | US9902714, Compound 4
Type:
Small organic molecule
Emp. Form.:
C25H28N6O2
Mol. Mass.:
444.5288
SMILES:
COc1cc(O)cc2N(CCN(Cc12)C(C)C)c1ccc2ncc(nc2c1)-c1cnn(C)c1
: