Target
Sigma non-opioid intracellular receptor 1
Ligand
BDBM413875
Substrate
Meas. Tech.
Receptor Radioligand Assay
Ki
<500±n/a nM
Citation
 Virgili-Bernado, MAlegret-Molina, C Substituted morpholine derivatives having activity against pain US Patent  US10421750 Publication Date 9/24/2019 
Target
Name:
Sigma non-opioid intracellular receptor 1
Synonyms:
Aging-associated gene 8 protein SGMR1_HUMAN SIGMAR1 SR31747-binding protein Sigma 1-type opioid receptor Sigma1R | hSigmaR1
Type:
Enzyme Catalytic Domain
Mol. Mass.:
25124.85
Organism:
Homo sapiens (Human)
Description:
Q99720
Residue:
223
  
Inhibitor
Name:
BDBM413875
Synonyms:
7-ethyl-5-(1-phenethylpiperidin-4-yl)- 4-oxa-7-azaspiro[2.5]octan-8-one | US10421750, Example 7
Type:
Small organic molecule
Emp. Form.:
C21H30N2O2
Mol. Mass.:
342.4751
SMILES:
CCN1CC(OC2(CC2)C1=O)C1CCN(CCc2ccccc2)CC1
: