Target
Sigma non-opioid intracellular receptor 1
Ligand
BDBM413910
Substrate
Meas. Tech.
Receptor Radioligand Assay
Ki
<500±n/a nM
Citation
 Virgili-Bernado, MAlegret-Molina, C Substituted morpholine derivatives having activity against pain US Patent  US10421750 Publication Date 9/24/2019 
Target
Name:
Sigma non-opioid intracellular receptor 1
Synonyms:
Aging-associated gene 8 protein SGMR1_HUMAN SIGMAR1 SR31747-binding protein Sigma 1-type opioid receptor Sigma1R | hSigmaR1
Type:
Enzyme Catalytic Domain
Mol. Mass.:
25124.85
Organism:
Homo sapiens (Human)
Description:
Q99720
Residue:
223
  
Inhibitor
Name:
BDBM413910
Synonyms:
5-(1-isobutylpiperidin-4-yl)-7-(4- methoxybenzyl)-4-oxa-7- azaspiro[2.5]octane | US10421750, Example 46
Type:
Small organic molecule
Emp. Form.:
C23H36N2O2
Mol. Mass.:
372.5441
SMILES:
COc1ccc(CN2CC(OC3(CC3)C2)C2CCN(CC(C)C)CC2)cc1
: